{"text_format":"1","workbook":"xlsx","n_sheets":2,"sheets":["Τιμ. 1","ΠΕΛΑΤΕΣ"],"not_rendered":{"charts":0,"images":0,"macros":1,"external_links":0,"defined_names":1,"comments":0,"pivot_tables":0},"unopened":[],"bounds":{"document_bytes":16777216,"sheet_cells":100000,"rows_first":2000,"rows_last":500,"rows_between":2000,"halvings":0,"cell_chars":16384,"cell_head_chars":4096},"cells_cut":0,"cells_raw":0,"read":"whole","date_system":"1900"}

{"sheet":"Τιμ. 1","index":0,"n_rows":37,"n_cols":10,"rows_kept":37,"cut":false,"hidden":false,"merged":[[31,0,31,6],[28,0,28,6],[35,2,35,6],[36,2,36,6],[32,0,32,1],[33,0,33,1],[34,0,34,1],[35,0,35,1],[36,0,36,1],[27,8,27,9],[28,8,28,9],[29,8,36,9],[7,0,7,8],[8,2,8,8],[9,2,9,8],[10,2,10,8],[23,0,23,3],[23,4,23,7],[24,0,24,3],[25,0,25,7],[29,0,30,6],[24,4,24,7],[32,2,32,6],[33,2,33,6],[34,2,34,6],[26,0,26,7],[11,2,11,8],[12,2,12,8],[13,2,13,8],[19,1,19,8],[20,1,20,8],[22,0,22,7],[14,1,14,8],[15,1,15,8],[16,1,16,8],[17,1,17,8],[18,1,18,8],[21,1,21,8],[0,0,0,9],[1,0,1,9],[2,0,2,9],[5,0,5,9],[3,0,3,9],[4,0,4,9],[6,0,6,9],[8,9,9,9],[12,9,13,9]]}
["ΕΠΩΝΥΜΙΑ"]
["ΕΠΑΓΓΕΛΜΑ"]
["ΔΙΕΥΘΥΝΣΗ"]
["Τηλ. +30 0000000000  Φαξ. +30 0000000000"]
["Α.Φ.Μ.: 999999999 - Δ.Ο.Υ.: ΧΧΧΧΧΧΧΧΧΧΧ  "]
["mail to : user@gmail.com"]
["Τ Ι Μ Ο Λ Ο Γ Ι Ο - I N V O I C E "]
["Στοιχεία  Πελάτη ",null,null,null,null,null,null,null,null,"Νο:"]
["Επωνυμία:",null,"ΑΘΑΝΑΣΙΟΥ ΑΘΑΝΑΣΙΟΣ",null,null,null,null,null,null,"…"]
["Επάγγελμα:",null,{"$f":"INDEX(ΠΕΛΑΤΕΣ!D:D,MATCH('Τιμ. 1'!$C$9,ΠΕΛΑΤΕΣ!$A:$A,0))","v":"ΕΜΠΟΡΙΟ ΥΠΟΛΟΓΙΣΤΩΝ"}]
["Διεύθυνση:",null,{"$f":"INDEX(ΠΕΛΑΤΕΣ!E:E,MATCH('Τιμ. 1'!$C$9,ΠΕΛΑΤΕΣ!$A:$A,0))","v":"ΤΣΙΜΙΣΚΗ 15 ΘΕΣΣΑΛΟΝΙΚΗ"},null,null,null,null,null,null,"Σειρά   :    -"]
["Τηλ.:",null,{"$f":"INDEX(ΠΕΛΑΤΕΣ!F:F,MATCH('Τιμ. 1'!$C$9,ΠΕΛΑΤΕΣ!$A:$A,0))","v":"210-9999999"},null,null,null,null,null,null,"Ημερομηνία"]
["Α.Φ.Μ:",null,{"$f":"INDEX(ΠΕΛΑΤΕΣ!B:B,MATCH('Τιμ. 1'!$C$9,ΠΕΛΑΤΕΣ!$A:$A,0))","v":999999999},null,null,null,null,null,null,"..../..../201.."]
["Δ.Ο.Υ.:",null,{"$f":"INDEX(ΠΕΛΑΤΕΣ!C:C,MATCH('Τιμ. 1'!$C$9,ΠΕΛΑΤΕΣ!$A:$A,0))","v":"Α' ΘΕΣΣΑΛΟΝΙΚΗΣ"}]
["Α.Α","Αιτιολογία",null,null,null,null,null,null,null,"Αξία"]
[1,"Λογιστικές Υπηρεσίες μηνός",null,null,null,null,null,null,null,100]
[2]
[3]
[4]
[5]
[6]
[7]
["Επί της καθαρής αξίας ανω των 300,00€ γίνεται παρακράτηση Φόρου 20%  (Άρθρο 64 §1 περ. δ΄ εδάφιο 1 & §8 του Ν.4172/2013)",null,null,null,null,null,null,null,"Αρχική Αξία",{"$f":"SUM(J16:J22)","v":100}]
["Αξία παρακράτησης  σε  Ευρώ :",null,null,null,{"$f":"IF(J25>300,J25*20%,0)","v":0},null,null,null,"Έκπτωση",0]
["Πληρωτέο ποσό  σε  Ευρώ :",null,null,null,{"$f":"J27-E24","v":123},null,null,null,"Καθαρή Αξία",{"$f":"+J23-J24","v":100}]
[null,null,null,null,null,null,null,null,"ΦΠΑ 23%",{"$f":"+J25*0.23","v":23}]
["Τρόπος πληρωμής :        Μετρητοίς          Με Πίστωση    ",null,null,null,null,null,null,null,"Σύνολο",{"$f":"+J26+J25","v":123}]
[]
["Ποσό ολογράφως",null,null,null,null,null,null,null,"Για την έκδοση"]
[{"$f":"UPPER(LOWER(HellasEuro(J27)))","v":"ΕΚΑΤΟΝ ΕΙΚΟΣΙ ΤΡΙΑ ΕΥΡΩ ΚΑΙ ΜΗΔΕΝ ΛΕΠΤΑ."},null,null,null,null,null,null,null,"Σφραγίδα "]
[]
["Τραπεζικοί Λογαριασμοί"]
["Εθνική",null,"GRΧΧΧΧΧΧΧΧΧΧΧΧΧΧΧΧΧΧΧΧΧΧΧΧΧ"]
["Eurobank",null,"GRΧΧΧΧΧΧΧΧΧΧΧΧΧΧΧΧΧΧΧΧΧΧΧΧΧ"]
["Πειραιώς",null,"GRΧΧΧΧΧΧΧΧΧΧΧΧΧΧΧΧΧΧΧΧΧΧΧΧΧ"]
["Αlpha",null,"GRΧΧΧΧΧΧΧΧΧΧΧΧΧΧΧΧΧΧΧΧΧΧΧΧΧ"]
["ΗΠΕΙΡΟΥ",null,"GRΧΧΧΧΧΧΧΧΧΧΧΧΧΧΧΧΧΧΧΧΧΧΧΧΧ"]

{"sheet":"ΠΕΛΑΤΕΣ","index":1,"n_rows":4,"n_cols":8,"rows_kept":4,"cut":false,"hidden":false,"merged":[]}
["ΕΠΩΝΥΜΙΑ","ΑΦΜ","Δ.Ο.Υ.","ΕΠΑΓΓΕΛΜΑ","ΔΙΕΥΘΥΝΣΗ","ΤΗΛΕΦΩΝΟ","EMAIL","ΠΟΣΟ"]
["ΔΙΑΦΟΡΟΙ",null,null,"ΙΔΙΩΤΗΣ","ΚΙΜΩΛΟΥ 25 ΑΘΗΝΑ","210-9999999"]
["ΑΘΑΝΑΣΙΟΥ ΑΘΑΝΑΣΙΟΣ",999999999,"Α' ΘΕΣΣΑΛΟΝΙΚΗΣ","ΕΜΠΟΡΙΟ ΥΠΟΛΟΓΙΣΤΩΝ","ΤΣΙΜΙΣΚΗ 15 ΘΕΣΣΑΛΟΝΙΚΗ","210-9999999"]
["ΓΕΩΡΓΙΟΥ ΓΕΩΡΓΙΟΣ",999999999,"Δ' ΑΘΗΝΩΝ","ΠΑΡΟΧΗ ΥΠΗΡΕΣΙΩΝ","ΚΙΜΩΛΟΥ 25 ΑΘΗΝΑ","210-9999999"]